CumulativeDistributionFunction
term status: testing
comment: A cumulative distribution function (cdf) is a probabilty distribution defined by giving the cumulative probability at an increasing sequence of measurement values. The range of possible measurement values may be unbounded. If a lower bound exists, it is given by ems:low. If an upper bound exists, it is given by ems:high. The graph of the cumulative distribution function is given by a set of measurement values at an increasing sequence of cumulative probabilities between 0 and 1. The cumulative probability values are given by one or more ems:cdfPoint properties.
subclass of: ProbabilityDistribution
type: Class

Fact
term status: testing
comment: This class describes a row of a fact table (see ems:FactTable). Each fact row has a set of dimension cells (see ems:DimensionCell) and measure cells (see ems:MeasureCell). These MUST match the description of the columns given in the head of the fact table (see ems:Head).
type: Class

NormalDistribution
term status: testing
comment: A normal distribution (also known as a Gaussian distribution is a probability distribution that naturally arises as the limit of many random factors. It is symmetric about its mean and has a certain scale. The mean is given by ems:mu. Its scale (also known as its standard deviation) is given by ems:scale.
subclass of: ProbabilityDistribution
type: Class

DimensionCell
term status: testing
comment: This class describes a dimension cell in a row of a fact table. A dimension cell refers to its column (see ems:inColumn and has a dimension member (see ems:dimensionMember).
type: Class

distribution
term status: testing
range: ProbabilityDistribution
comment: This property links a resource, e.g. ems:MeasureDistribution to a probability distribution.
type: Property

Head
term status: testing
comment: This class defined the columns of a fact table. A fact table MUST have one or more dimension columns, e.g. date or role, and one or more measure columns, e.g. cost or effort. The dimension columns contain dimension values. Dimension columns SHOULD contain standard dimension values when they exist, e.g. for roles. The creator of the fact table MAY use custom dimension dimension values and record how these custom values are mapped to the standard values.
type: Class

DimensionMember
term status: testing
comment: A dimension member is some subset of a dimension. For example, work on a project is performed by people in various roles. It is often of interest to break down an effort estimate or measurement by role. Members of the dimension role (dimension:Role) include manager (dimension-member:Manager and programmer (dimension-member:Programmer).
type: Class

wbsFormat
term status: testing
range: WbsFormat
domain: WorkBreakdownStructure
comment: This property links a WBS resource to the XML format of its content. EMS does not define a format for WBS content. Instead, this property identifies the specification that defines the XML format of the WBS content.
type: Property

Measure
term status: stable
comment: A measure, as in the idiom take the measure of, is the result of observing some numerically quantifiable aspect of a project, system, or thing. For example, a duration of 12 months or a size of 10 KLOC are measures. The aspect being measured, e.g. duration or size, is referred to as the metric and is given by the property ems:metric. The scale of measurement, e.g. months or KLOC, is referred to as the unit of measure and is given by the property ems:unitOfMeasure. The numeric value of an observation, e.g. 12 or 10, is given by the property ems:numericValue.
type: Class

FactDistributionTable
term status: testing
comment: A fact distribution table is a fact table that contains probability distributions instead of precise numeric values for its measures. Fact distribution tables are used in scenario assumptions (see ems:assumesTable) and estimate predictions (see ems:predictsTable). A fact distribution table is similar to a fact table (see ems:FactTable), except that it has fact distribution rows (see ems:FactDistribution) instead of fact rows (see ems:Fact), and they have measure distribution cells (see ems:MeasureDistributionCell) instead of measure cells (see ems:MeasureCell).
type: Class

inColumn
term status: testing
comment: This property links a cell to its column. Dimension cells (see ems:DimensionCell) are linked to dimension columns (see ems:DimensionColumn). Measure cells (see ems:MeasureCell) are linked to measure columns (see ems:MeasureColumn).
type: Property

predicts
term status: testing
range: MeasureDistribution
domain: Estimate
comment: This property links an estimate to the predicted value for some measure, e.g. duration, size. The predicted value is a probability distribution.
type: Property

dimension
prefix base: dimension#
prefix: dimension
type: PrefixDefinition

Format
term status: testing
comment: A format is a specification of the syntax of an artifact.
type: Class

isClosed
term status: testing
domain: Project
comment: This boolean property indicates if the project is closed. No further activities or measurements are done on closed projects. The measurements of closed projects can be used to calibrate the estimates for new projects. When a project is completed and all measurements on it have been performed, it is marked as closed by setting this property to true.
type: Property

PointEstimate
term status: testing
comment: A point estimate is a probability distribution that is concentrated at a single value. The single value is given by ems:numericValue.
subclass of: ProbabilityDistribution
type: Class

MeasureColumn
term status: testing
comment: This class describes a measure column of a fact table. A measure column has a metric (see ems:metric and a unit of measure (see ems:unitOfMeasure.
type: Class

numberOfQuantiles
term status: testing
domain: QuantileDistribution
comment: This property gives the number of quantiles parameter value of a probability distribution.
type: Property

predictsTable
term status: testing
range: FactDistributionTable
domain: Estimate
comment: This property links an estimate to the predicted value for some fact table of measures, e.g. staffing by week. The predicted fact table contains probability distributions.
type: Property

fact
term status: testing
range: Fact
comment: This property links a fact table to its fact rows. In general, a fact table will have many fact rows. If the fact table has an ems:tableSource property, then the rows of the fact table MUST be a copy of the data values received in the response of an HTTP GET request of the URL of the remote table source.
type: Property

PoissonDistribution
term status: testing
comment: A Poisson distribution is a probability distribution that gives the probability that a given number of events will occur in a fixed time period. This distribution is completely specified by a single parameter often denoted by the Greek letter lambda. Lambda is given by ems:lambda.
subclass of: ProbabilityDistribution
type: Class

ReliabilityMetric
term status: testing
subclass of: Metric
comment: A reliability metric is a metric that measures the correctness or absence of failures in a system such as a software system. For example defects (metric:Defects), failures (metric:Failures), and mean time to failure (metric:MeanTimeToFailure) are reliability metrics.
type: Class

mu
term status: testing
domain: ProbabilityDistribution
comment: This property gives the mu parameter value of a probability distribution.
type: Property

assumesTable
term status: testing
range: FactDistributionTable
domain: Scenario
comment: This property links a scenario to the assumed value for some fact table of measures, e.g. staffing by week. The assumed fact table contains probability distributions.
type: Property

assumes
term status: testing
range: MeasureDistribution
domain: Scenario
comment: This property links a scenario to the assumed value for some measure, e.g. duration, size. The assumed value is a probability distribution.
type: Property

numericValue
term status: stable
comment: This property gives the numeric value of a resource. For example, the numeric value of the measure duration of 12 months is 12. The datatype of this property is typically xsd:double.
type: Property

head
term status: testing
range: Head
comment: This property links a fact table to an ems:Head resource that describes the columns of the table.
type: Property

seeAlsoProject
term status: testing
domain: Project
comment: This property links a project to a corresponding resource in a project management application.
type: Property

memberBaseline
term status: testing
range: Baseline
domain: BaselineList
comment: This property links a baseline list to its member baselines.
type: Property

measureCell
term status: testing
range: MeasureCell
comment: This property links a fact row to one or more of its measure cells.
type: Property

WbsFormat
term status: testing
subclass of: Format
comment: A WBS format is a format that specifies the syntax of work breakdown structures. For example, http://schemas.microsoft.com/project/2007 is the format for Microsoft Office Project 2007 XML Data Interchange Schema.
type: Class

map
term status: testing
range: Map
comment: This property links a fact table head to an ems:Map resource that defines how custom dimension values are mapped to standard values. The scope of this mapping is local to the fact table.
type: Property

FinancialMetric
term status: testing
subclass of: Metric
comment: A financial metric is a metric that measures the cost of an artifact or work effort. For example, total cost (metric:Cost) and labor cost (metric:LaborCost) are financial metrics.
type: Class

low
term status: testing
domain: ProbabilityDistribution
comment: This property gives the low parameter value of a probability distribution.
type: Property

memberScenario
term status: testing
range: Scenario
domain: ScenarioList
comment: This property links a scenario list to its member scenarios.
type: Property

Estimate
term status: testing
comment: An estimate is a probabilistic prediction, based on a scenario, for a set of measurements.
type: Class

WorkBreakdownStructure
term status: testing
comment: This class describes work breakdown structures. A work breakdown structure (WBS) is a common way to represent the work to be performed in a project. In EMS, a WBS may be used as an assumption in an scenario, as a prediction in an estimate, or as an observation in a measurement. A WBS has a format (see ems:wbsFormat), and may either include (see ems:wbsContent) or link to (see ems:wbsSource) its content. The included or linked WBS content MUST be in the specified format.
type: Class

MeasureCell
term status: testing
comment: This class descibes measure cells. A measure cell refers to a measure column (see ems:inColumn) and has a numeric value (see ems:numericValue.
type: Class

metric
prefix base: metric#
prefix: metric
type: PrefixDefinition

Map
term status: testing
comment: Some key dimensions may define standard dimension member URIs which are used for data interchange. However, users may wish to use custom values. This class lets you define how custom values are mapped to standard URIs. You can include an map resource in the description of a dimension column of a fact table (see ems:useMap). We make the simplifying assumption that this mapping is many-to-one, that is, one or more custom dimension values may be mapped to the same standard dimension value. A map may contain one or more of these mappings (see ems:mapping), but each custom dimension value must map to exactly one standard dimension value.
type: Class

measurementList
term status: testing
range: MeasurementList
domain: Service
comment: This property links a service to its measurement list.
type: Property

FactDistribution
term status: testing
comment: A fact distribution is a row of a fact distribution table (see ems:FactDistributionTable). It contains one or more dimension cells (see ems:dimensionCell) and one or more measure distribution cells (see ems:measureDistributionCell).
type: Class

ScenarioList
term status: testing
comment: A scenario list is a container for scenario resources.
type: Class

CdfPoint
term status: testing
comment: This class describes a point on the graph of a cumulative probability function. The cumulative probability at a point is given by ems:probability. The cumulative probability MUST be greater than 0 and less than 1. The measurement value is given by ems:numericValue. The probability that a measurement gives a value less than or equal to the numeric value is equal to the cumulative probability.
type: Class

estimate
term status: testing
comment: The property links a resource to an estimate.
type: Property

lambda
term status: testing
domain: PoissonDistribution
comment: This property gives the lambda parameter value of a Poission distribution.
type: Property

extendsScenario
term status: testing
range: Scenario
domain: Scenario
comment: This property links a scenario a base scenario that it extends. The base scenario contains assumptions that can be included in several other extended scenarios.
type: Property

wbsSource
term status: testing
domain: WorkBreakdownStructure
comment: This property links a WBS resource to a resource that contains the WBS XML content. This content MUST be in the XML format specified by the WBS resource. When this link is deferenced using an HTTP GET request, the response MUST be the WBS. If this property is absent, then the WBS resource MUST have a ems:wbsContent property.
type: Property

MeasureDistribution
term status: testing
comment: A measure distribution is like a measure (see ems:Measure) except that it gives a probability distribution for the numeric value of a measure instead of a precise numeric value. Measure distributions are used in scenario assumptions (see ems:assumes and ems:assumesTable) and estimate predications (see ems:predicts and ems:predictsTable).
type: Class

TimeMetric
term status: testing
comment: A time metric is a metric that describes some temporal aspect of a project, system, or thing. For example, duration (metric:Duration), start (metric:Start), and finish (metric:Finish) are time metrics.
subclass of: Metric
type: Class

currentBaseline
term status: testing
range: Baseline
domain: Project
comment: This property links a project to its current baseline.
type: Property

MeasurementList
term status: testing
comment: A measurement list is a container for measurement resources.
type: Class

ProbabilityDistribution
term status: testing
comment: This class describes probability distributions. A probability distribution gives the likelihood that a measurement of some value (a random variable) will fall within some given range. Probability distributions are used in scenario assumptions (see ems:assumes) and estimate predictions (see ems:predicts).
type: Class

seeAlsoPerformance
term status: testing
domain: Project
comment: This property links a project to a corresponding resource in a performance management application.
type: Property

observesTable
term status: testing
range: FactTable
comment: This property links a measurement to the observed fact table. The fact table analyzes the measurement along one or more dimensions.
type: Property

realProjectId
term status: testing
domain: Project
comment: This property links a project to an identifier of the project as a real-world object.
type: Property

probability
term status: testing
comment: This property gives the cumulative probability. For example, the cumulative probability of the third quartile is 75%.
type: Property

service
term status: testing
range: Service
comment: This property is used to link a resource to the EMS service instance that hosts it.
type: Property

unit
prefix base: unit#
prefix: unit
type: PrefixDefinition

Metric
term status: stable
comment: A metric is a procedure or algorithm for quantifying or measuring some aspect of a thing, system, event, etc. For example duration is a metric that measures the amount of time an activity takes.
type: Class

observesWbs
term status: testing
range: WorkBreakdownStructure
comment: This property links a measurement to the observed work breakdown structure.
type: Property

scenarioList
term status: testing
range: ScenarioList
domain: Service
comment: This property links a service to its scenario list.
type: Property

mapping
term status: testing
range: Mapping
domain: Map
comment: This property links a map to a mapping. A map may have one or more mappings.
type: Property

cdfPoint
term status: testing
range: CdfPoint
domain: CumulativeDistributionFunction
comment: This property links a cumulative probability function resource to one or more points on its graph.
type: Property

seeAlsoEstimation
term status: testing
domain: Project
comment: This property links a project to a corresponding resource in an estimation application.
type: Property

measureDistributionCell
term status: testing
range: MeasureDistributionCell
comment: This property links a fact distribution row to a measure distribution cell.
type: Property

OSLC EMS Vocabulary
date copyrighted: 2010, 2015
source: ems.ttl
description: This vocabulary defines estimation and measurement resources and a service for managing them in projects. Some terms of this vocabulary have been finalized for use by OSLC Performance Monitoring 2.0.
title: OSLC Estimation and Measurement Service (EMS) Vocabulary
type: Ontology

memberProject
term status: testing
range: Project
domain: ProjectList
comment: This property links a project list to its member projects.
type: Property

TriangularDistribution
term status: testing
comment: A triangular distribution is a probability distribution that concentrated between high and low values, and that linearly rises to and falls from to an intermediate most likely value. The low value is given by ems:low. The most likely value is given by ems:mostLikely. The high value is given by ems:high.
subclass of: ProbabilityDistribution
type: Class

observes
term status: stable
range: Measure
comment: This property links a measurement to the observed value of a measure. In an EMS service, the measurement is a resource of type ems:Measurement which may observe zero or more measures. For example, a measurement at the end of a project may observe a duration of 12 months and a cost of 200,000 USD.
type: Property

project
term status: testing
range: Project
comment: The property links a resource to a project.
type: Property

useMap
term status: testing
range: Map
comment: This property links a resource to a map.
type: Property

projectList
term status: testing
range: ProjectList
domain: Service
comment: This property links a service to its project list.
type: Property

Service
type: Class
term status: testing
comment: An EMS service hosts and manages a set of resources that describe projects, scenarios, estimates, measurements, and baselines. Each instance of an service has a set of resource containers that contain resources of a given type.

wbsContent
term status: testing
domain: WorkBreakdownStructure
comment: This property gives the literal XML WBS content of a WBS resource. This content MUST be in the XML format specified by the WBS resource. If this property is absent, then ems:wbsSource MUST be present. If this property and ems:wbsSource are present, then the value of this property SHOULD be the XML document representation returned in the HTTP GET response for the link given in ems:wbsSource.
type: Property

metric
term status: stable
range: Metric
comment: This property links a measure to its metric. For example, the measure duration of 12 months has the metric duration.
type: Property

seeAlsoPortfolio
term status: testing
domain: Project
comment: This property links a project to a corresponding resource in a portfolio management application.
type: Property

grain
prefix base: grain#
prefix: grain
type: PrefixDefinition

Mapping
term status: testing
comment: This class describes a mapping. A mapping maps some custom string label value for a dimension (see ems:from) to a dimension member URI which may be a standard value defined in some vocabulary. (see ems:to).
type: Class

from
term status: testing
domain: Mapping
comment: This property links a mapping to its custom label value. The value MUST be unique within its enclosing map resource.
type: Property

tableSource
term status: testing
range: FactTable
comment: Fact tables contain actual measurements for projects, systems, or things. In practice, there may be many measurements and they may be updated frequently. The measurements may be at a finer level of granularity than the estimates, e.g. a project may estimate total defects found per month, whereas the actual number found may be collected daily. Furthermore, these measurements are often collected automatically by software development tools such as bug tracking systems or source code control systems. It may therefore be useful to simply refer to the source of the measurements rather than copy the actual measurements into the EMS service provider, e.g. a dynamic query on a software tool may generate the fact table on demand. This property lets you refer to the remote source of the fact table data via a URL. An HTTP GET request on this URL MUST return an ems:FactTable resource whose dcterms:title and ems:head properties match this resource.
type: Property

dimension
term status: testing
range: Dimension
comment: This property links a resource to a dimension.
type: Property

high
term status: testing
domain: ProbabilityDistribution
comment: This property gives the high parameter value of a probability distribution.
type: Property

memberEstimate
term status: testing
comment: This property links an estimate list to its member estimates.
type: Property

MeasureDistributionCell
term status: testing
comment: A measure distribution cell is a cell in a fact distribution row. It refers to its column (see ems:inColumn) and contains a measure distribution (see ems:distribution).
type: Class

assumesWbs
term status: testing
range: WorkBreakdownStructure
domain: Scenario
comment: This property links a scenario to the assumed work breakdown structure.
type: Property

EffortMetric
term status: testing
comment: An effort metric is a metric that measures the effort of effort required to perform some task. For example, effort as measured in person-months, person-years, etc. (metric:Effort), average staffing (metric:Staffing), peak staffing (metric:PeakStaffing), and full-time equivalents (metric:FullTimeEquivalent) are effort metrics.
subclass of: Metric
type: Class

to
term status: testing
range: DimensionMember
domain: Mapping
comment: This property links a mapping to its dimension member URI. Many mappings MAY map to the same dimension member URI.
type: Property

dimensionColumn
term status: testing
range: DimensionColumn
comment: This property links the head of a fact table to one or more ems:DimensionColumn resources that define dimension columns. Every fact table MUST have at least one dimension column.
type: Property

grain
term status: testing
range: Grain
comment: This property links a resource to a grain.
type: Property

Project
term status: testing
comment: Within the scope of EMS, a project is any activity, system, or thing that can be the subject of a set of measurements. In practice, a project is often a time-bounded work effort that produces a unique result.
type: Class

ProjectList
term status: testing
comment: A project list is a container for projects.
type: Class

SizeMetric
term status: testing
subclass of: Metric
comment: A size metric is a metric that measures the magnitude, volume, bulk, or capability of some artifact such as software. For example, lines of code (metric:Sloc) and story points (metric:StoryPoints) are size metrics.
type: Class

isActive
term status: testing
domain: Scenario
comment: This boolean property indicates if a scenario is under active consideration. When a scenario has been ruled out, it is marked as inactive by setting this property to false.
type: Property

dimension-member
prefix base: dimension-member#
prefix: dimension-member
type: PrefixDefinition

scale
term status: testing
domain: ProbabilityDistribution
comment: This property gives the scale parameter value of a probability distribution. This parameter is also known as the standard deviation and is often denoted by the Greek letter sigma.
type: Property

EstimateList
term status: testing
comment: An estimate list is a container for estimate resources.
type: Class

Baseline
term status: testing
comment: A baseline is a set of estimates, based on some scenario, that are used to track the performance of a project.
type: Class

Dimension
term status: testing
comment: A dimension is some aspect of an aggregated quantity which lets the aggregate be analyzed. For example, the total effort expended in a project can be analyzed by week or month. Therefore time (dimension:Time) is a dimension of effort (metric:Effort).
type: Class

BaselineList
term status: testing
comment: A baseline list is a container for baseline resources.
type: Class

ProductivityMetric
term status: testing
subclass of: Metric
comment: A productivity metric is a metric that measures the rate at which some artifact, such as software, is produced. For example, lines of code per unit time (metric:EslocPerTime) and team velocity (metric:TeamVelocity) are productivity metrics.
type: Class

unitOfMeasure
term status: stable
range: UnitOfMeasure
domain: Measure
comment: This property gives the unit of measure. For example, the measure duration of 12 months has a unit of measure months.
type: Property

memberMeasurement
term status: testing
range: Measurement
domain: MeasurementList
comment: This property links a measurement list to its member measurements.
type: Property

Quantile
term status: testing
comment: This class describes a quantile of a quantile function. The cumulative probability of a quantile is given by ems:probability. The cumulative probability MUST be greater than 0 and less than 1. The upper limit of the range of measurement values is given by ems:numericValue. The lower limit of the range of measurement values is given by the upper limit of the preceding quantiles. The probability that a measurement gives a value less than or equal to the numeric value is equal to the cumulative probability.
type: Class

ProcessMetric
term status: testing
subclass of: Metric
comment: A process metric is a metric that measures the process used to create an artifact such as software. For example, build (metric:Builds) and test executions (metric:TestExecutions) are process metrics.
type: Class

ems
prefix base: OSLC EMS Vocabulary
prefix: ems
type: PrefixDefinition

DimensionColumn
term status: testing
comment: This class describes a dimension column in a fact table. A dimension column has a dimension (see ems:dimension) and grain (see ems:grain and may refer to a map (see ems:useMap.
type: Class

Grain
term status: testing
comment: Dimensions may be aggregated into subsets of various sizes. A grain is a unit of aggregation of a dimension. For example, month (grain:CalendarMonth) and week (grain:CalendarWeek) are grain sizes for the dimension time (dimension:Time).
type: Class

QuantileDistribution
term status: testing
comment: A quantile function is a probability distribution that breaks up a range of values into quantiles that each have the same probability. When the number of quantiles is 4, 10, or 100, we refer to them as quartiles, deciles, and percentiles. For example, there is a 25% probability that a measurement will fall within any given quartile. The number of quantiles is given by ems:numberOfQuantiles. The number of quantiles MUST be greater than one. The range of possible measurement values may be unbounded. If a lower bound exists, it is given by ems:low. If an upper bound exists, it is given by ems:high. The graph of the quantile function is given by a set of measurement values that correspond to the equally spaced cumulative probabilities between 0 and 1. For example, for quartiles the cumulative probabilities are 25%, 50%, and 75%. The cumulative probability values are given by one or more ems:quantile properties.
subclass of: ProbabilityDistribution
type: Class

UniformDistribution
term status: testing
comment: A uniform distribution is a probability distribution that is evenly spread between a high and a low value. The high value is given by ems:high. The low value is given by ems:low.
subclass of: ProbabilityDistribution
type: Class

Scenario
term status: testing
comment: A scenario is a set of assumptions about how a project will be executed. These assumptions are used as inputs to estimates.
type: Class

predictsWbs
term status: testing
range: WorkBreakdownStructure
domain: Estimate
comment: This property links an estimate to the predicted work breakdown structure.
type: Property

mostLikely
term status: testing
domain: ProbabilityDistribution
comment: This property gives the most likely parameter value of a probability distribution.
type: Property

estimateList
term status: testing
range: EstimateList
domain: Service
comment: This property links a service to its estimate list.
type: Property

dimensionCell
term status: testing
range: DimensionCell
comment: This property links a fact row to one or more of its dimension cells.
type: Property

format
prefix base: format#
prefix: format
type: PrefixDefinition

baselineList
term status: testing
range: BaselineList
domain: Service
comment: This property links a service to its baseline list.
type: Property

UnitOfMeasure
term status: testing
comment: A unit of measure specifies a procedure for associating a numeric value with some metric. For example, month (unit:Month) is a unit of measure for duration (metric:Duration).
type: Class

FactTable
term status: testing
comment: This class is used to represent fact tables. Consider the work performed on a project. Work may be analyzed according to attributes such as who performed the work, the task or activity that the work accomplished, when the work was performed, etc. These attributes are referred to as dimensions. Work may be quantified by such metrics as its effort in person-hours, its cost in some currency, its duration in months, its peak staffing, etc. These quantities are referred to as measures. The term dimension is used because the measures can be regarded as occupying cells in a multi-dimensional array (sometimes referred to as a datacube). It is frequently of interest to summarize the measures along a dimension, for example given the effort by activity, calculate the total effort for all activities. Conversely, given the total effort, it may be of interest to see how it is broken down by activity. In general, set of related measures, analyzed along a set of dimensions may be organized into a fact table. Each row of a fact table contains a set of measures (e.g. effort and cost) for a given combination of dimension values (e.g. activity and month). This resource MAY contain the actual measurements, provide a link to the source of the actual measurements, or contain both a link to the source and a copy of the actual measurements obtained from the source (i.e. a cached copy of the source).
type: Class

quantile
term status: testing
range: Quantile
domain: QuantileDistribution
comment: This property links a quantile function resource to one or more quantiles.
type: Property

dimensionMember
term status: testing
range: DimensionMember
comment: This property links a dimension cell to its dimension member.
type: Property

Measurement
term status: testing
comment: A measurement is a set of observations of numerically quantifiable aspects of a project, system, or thing.
type: Class

measureColumn
term status: testing
comment: This property links the head of a fact table to one or more ems:MeasureColumn resources that define measure columns. Every fact table MUST have at least one measure column.
type: Property

scenario
term status: testing
range: Scenario
comment: The property links a resource to a scenario.
type: Property